Target
Fatty-acid amide hydrolase 1
Ligand
BDBM50394640
Substrate
Meas. Tech.
ChEMBL_857860 (CHEMBL2169493)
IC50
128±n/a nM
Citation
 Keith, JMApodaca, RTichenor, MXiao, WJones, WPierce, JSeierstad, MPalmer, JWebb, MKarbarz, MScott, BWilson, SLuo, LWennerholm, MChang, LBrown, SRizzolio, MRynberg, RChaplan, SBreitenbucher, JG Aryl Piperazinyl Ureas as Inhibitors of Fatty Acid Amide Hydrolase (FAAH) in Rat, Dog, and Primate. ACS Med Chem Lett 3:823-827 (2012)  
Target
Name:
Fatty-acid amide hydrolase 1
Synonyms:
Anandamide amidohydrolase FAAH FAAH1_HUMAN Fatty-acid amide hydrolase (FAAH) Oleamide hydrolase 1
Type:
Protein
Mol. Mass.:
63071.19
Organism:
Homo sapiens (Human)
Description:
O00519
Residue:
579
  
Inhibitor
Name:
BDBM50394640
Synonyms:
CHEMBL1895507
Type:
Small organic molecule
Emp. Form.:
C18H20ClN3O
Mol. Mass.:
329.824
SMILES:
Clc1ccc(CN2CCN(CC2)C(=O)Nc2ccccc2)cc1
: