Target
5-hydroxytryptamine receptor 7
Ligand
BDBM21392
Substrate
Meas. Tech.
ChEMBL_859812 (CHEMBL2166096)
Ki
0.3±n/a nM
Citation
 Lacivita, EPatarnello, DStroth, NCaroli, ANiso, MContino, MDe Giorgio, PDi Pilato, PColabufo, NABerardi, FPerrone, RSvenningsson, PHedlund, PBLeopoldo, M Investigations on the 1-(2-biphenyl)piperazine motif: identification of new potent and selective ligands for the serotonin(7) (5-HT(7)) receptor with agonist or antagonist action in vitro or ex vivo. J Med Chem 55:6375-80 (2012)  
Target
Name:
5-hydroxytryptamine receptor 7
Synonyms:
5-HT-7 5-HT7 5-HT7S 5HT7 HTR7 | Serotonin receptor 7
Type:
G Protein-Coupled Receptor (GPCR)
Mol. Mass.:
53573.08
Organism:
Homo sapiens (Human)
Description:
P34969
Residue:
479
  
Inhibitor
Name:
BDBM21392
Synonyms:
3-(2-aminoethyl)-1H-indole-5-carboxamide 5-CT,DP CHEMBL1256863 [3H]-5-CT [3H]-5-Carboxyamidotryptamine | [3H]-5-carboxamidotryptamine
Type:
Small organic molecule
Emp. Form.:
C11H13N3O
Mol. Mass.:
203.2404
SMILES:
NCCc1c[nH]c2ccc(cc12)C(N)=O
: