Target
Glucose-6-phosphate dehydrogenase
Ligand
BDBM50396513
Substrate
Meas. Tech.
ChEMBL_862644 (CHEMBL2174117)
IC50
5000±n/a nM
Citation
 Preuss, JMaloney, PPeddibhotla, SHedrick, MPHershberger, PGosalia, PMilewski, MLi, YLSugarman, EHood, BSuyama, ENguyen, KVasile, SSergienko, EMangravita-Novo, AVicchiarelli, MMcAnally, DSmith, LHRoth, GPDiwan, JChung, TDJortzik, ERahlfs, SBecker, KPinkerton, ABBode, L Discovery of a Plasmodium falciparum glucose-6-phosphate dehydrogenase 6-phosphogluconolactonase inhibitor (R,Z)-N-((1-ethylpyrrolidin-2-yl)methyl)-2-(2-fluorobenzylidene)-3-oxo-3,4-dihydro-2H-benzo[b][1,4]thiazine-6-carboxamide (ML276) that reduces parasite growth in vitro. J Med Chem 55:7262-72 (2012)  
Target
Name:
Glucose-6-phosphate dehydrogenase
Synonyms:
Glucose-6-phosphate 1-dehydrogenase | PFG6PD
Type:
PROTEIN
Mol. Mass.:
86360.63
Organism:
Plasmodium falciparum
Description:
ChEMBL_862647
Residue:
736
  
Inhibitor
Name:
BDBM50396513
Synonyms:
CHEMBL2171111
Type:
Small organic molecule
Emp. Form.:
C21H20FN3O2S
Mol. Mass.:
397.466
SMILES:
Fc1ccccc1\C=C1/Sc2ccc(cc2NC1=O)C(=O)NCC1CCCN1
: