Target
Hepatocyte growth factor receptor
Ligand
BDBM50396975
Substrate
Meas. Tech.
ChEMBL_863093 (CHEMBL2175489)
IC50
7±n/a nM
Citation
 Cui, JJMcTigue, MNambu, MTran-Dubé, MPairish, MShen, HJia, LCheng, HHoffman, JLe, PJalaie, MGoetz, GHRyan, KGrodsky, NDeng, YLParker, MTimofeevski, SMurray, BWYamazaki, SAguirre, SLi, QZou, HChristensen, J Discovery of a novel class of exquisitely selective mesenchymal-epithelial transition factor (c-MET) protein kinase inhibitors and identification of the clinical candidate 2-(4-(1-(quinolin-6-ylmethyl)-1H-[1,2,3]triazolo[4,5-b]pyrazin-6-yl)-1H-pyrazol-1-yl)ethanol (PF-04217903) for the treatment of J Med Chem 55:8091-109 (2012)  
Target
Name:
Hepatocyte growth factor receptor
Synonyms:
Hepatocyte growth factor receptor Hepatocyte growth factor receptor (c-MET) MET Met proto-oncogene (hepatocyte growth factor receptor) Tyrosine-protein kinase Met (c-Met) c-Met kinase
Type:
Protein
Mol. Mass.:
155559.73
Organism:
Homo sapiens (Human)
Description:
P08581
Residue:
1390
  
Inhibitor
Name:
BDBM50396975
Synonyms:
CHEMBL2170956
Type:
Small organic molecule
Emp. Form.:
C18H13ClN6O
Mol. Mass.:
364.788
SMILES:
Cc1ccc(Cl)c2c3nn4c(Cc5ccc(O)cc5)nnc4nc3[nH]c12
: