Target
P2Y purinoceptor 12
Ligand
BDBM50397201
Substrate
Meas. Tech.
ChEMBL_864185 (CHEMBL2175134)
Ki
372±n/a nM
Citation
 Zech, GHessler, GEvers, AWeiss, TFlorian, PJust, MCzech, JCzechtizky, WGörlitzer, JRuf, SKohlmann, MNazaré, M Identification of high-affinity P2Y12 antagonists based on a phenylpyrazole glutamic acid piperazine backbone. J Med Chem 55:8615-29 (2012)  
Target
Name:
P2Y purinoceptor 12
Synonyms:
ADP-glucose receptor HORK3 P2T(AC) P2Y(AC) P2Y(cyc) P2Y12 platelet ADP receptor Purinergic receptor P2Y12 | SP1999
Type:
Enzyme
Mol. Mass.:
39458.48
Organism:
Homo sapiens (Human)
Description:
Q9H244
Residue:
342
  
Inhibitor
Name:
BDBM50397201
Synonyms:
CHEMBL2172278
Type:
Small organic molecule
Emp. Form.:
C26H33N5O9
Mol. Mass.:
559.5683
SMILES:
CCOC(=O)COc1cc(nn1-c1ccccc1)C(=O)N[C@@H](CCC(O)=O)C(=O)N1CCN(CC1)C(=O)OCC
: