Target
Vasopressin V2 receptor
Ligand
BDBM50052954
Substrate
Meas. Tech.
ChEMBL_864210 (CHEMBL2175262)
Ki
2.68±n/a nM
Citation
 Loison, SCottet, MOrcel, HAdihou, HRahmeh, RLamarque, LTrinquet, EKellenberger, EHibert, MDurroux, TMouillac, BBonnet, D Selective fluorescent nonpeptidic antagonists for vasopressin V2 GPCR: application to ligand screening and oligomerization assays. J Med Chem 55:8588-602 (2012)  
Target
Name:
Vasopressin V2 receptor
Synonyms:
ADHR AVPR2 DIR Renal-type arginine vasopressin receptor V2R_HUMAN Vasopressin V2 receptor | Vasopressin receptor
Type:
Receptor
Mol. Mass.:
40295.28
Organism:
Homo sapiens (Human)
Description:
P30518
Residue:
371
  
Inhibitor
Name:
BDBM50052954
Synonyms:
2-Methyl-N-[4-(2,3,4,5-tetrahydro-benzo[b]azepine-1-carbonyl)-phenyl]-benzamide | CHEMBL119793
Type:
Small organic molecule
Emp. Form.:
C25H24N2O2
Mol. Mass.:
384.4703
SMILES:
Cc1ccccc1C(=O)Nc1ccc(cc1)C(=O)N1CCCCc2ccccc12
: