Target
5-hydroxytryptamine receptor 3A
Ligand
BDBM50397290
Substrate
Meas. Tech.
ChEMBL_864726 (CHEMBL2174993)
Ki
0.0513±n/a nM
Citation
 Verheij, MHThompson, AJvan Muijlwijk-Koezen, JELummis, SCLeurs, Rde Esch, IJ Design, synthesis, and structure-activity relationships of highly potent 5-HT3 receptor ligands. J Med Chem 55:8603-14 (2012)  
Target
Name:
5-hydroxytryptamine receptor 3A
Synonyms:
5-HT-3 5-HT3A 5-hydroxytryptamine receptor 3 (5-HT3) 5-hydroxytryptamine receptor 3A (5HT3A) 5HT3R HTR3A Serotonin 3 receptor (5HT3) Serotonin-gated ion channel receptor | Serotonin-gated ion channel receptor 3
Type:
Protein
Mol. Mass.:
55283.27
Organism:
Homo sapiens (Human)
Description:
P46098
Residue:
478
  
Inhibitor
Name:
BDBM50397290
Synonyms:
CHEMBL475331 | VUF-10147
Type:
Small organic molecule
Emp. Form.:
C13H17N5
Mol. Mass.:
243.3076
SMILES:
CN1CCN(CC1)c1nc(N)c2ccccc2n1
: