Target
Fatty-acid amide hydrolase 1 [30-579]
Ligand
BDBM50307794
Substrate
Meas. Tech.
ChEMBL_862040 (CHEMBL2174069)
IC50
500±n/a nM
Citation
 Favia, ADHabrant, DScarpelli, RMigliore, MAlbani, CBertozzi, SMDionisi, MTarozzo, GPiomelli, DCavalli, ADe Vivo, M Identification and characterization of carprofen as a multitarget fatty acid amide hydrolase/cyclooxygenase inhibitor. J Med Chem 55:8807-26 (2012)  
Target
Name:
Fatty-acid amide hydrolase 1 [30-579]
Synonyms:
Anandamide amidohydrolase 1 Faah Fatty Acid Amide Hydrolase Fatty-acid amide hydrolase (FAAH) Fatty-acid amide hydrolase 1 (FAAH) Oleamide hydrolase 1
Type:
Single-pass membrane protein; homodimer
Mol. Mass.:
60474.00
Organism:
Rattus norvegicus (rat)
Description:
P97612 (aa 30-579)
Residue:
550
  
Inhibitor
Name:
BDBM50307794
Synonyms:
2-(4-isobutylphenyl)-N-(3-methylpyridin-2-yl)propanamide ibu-am5 (2)
Type:
Small organic molecule
Emp. Form.:
C19H24N2O
Mol. Mass.:
296.4067
SMILES:
CC(C)Cc1ccc(cc1)C(C)C(=O)Nc1ncccc1C
: