Target
Prostaglandin G/H synthase 1
Ligand
BDBM50397555
Substrate
Meas. Tech.
ChEMBL_862248 (CHEMBL2172929)
IC50
74300±n/a nM
Citation
 Favia, ADHabrant, DScarpelli, RMigliore, MAlbani, CBertozzi, SMDionisi, MTarozzo, GPiomelli, DCavalli, ADe Vivo, M Identification and characterization of carprofen as a multitarget fatty acid amide hydrolase/cyclooxygenase inhibitor. J Med Chem 55:8807-26 (2012)  
Target
Name:
Prostaglandin G/H synthase 1
Synonyms:
COX1 Cyclooxygenase-1 (COX-1) PTGS1 | Prostaglandin G/H synthase (cyclooxygenase)
Type:
Protein
Mol. Mass.:
68868.60
Organism:
Ovis aries (Sheep)
Description:
Residue:
600
  
Inhibitor
Name:
BDBM50397555
Synonyms:
CHEMBL2171252
Type:
Small organic molecule
Emp. Form.:
C22H15Cl2NO3
Mol. Mass.:
412.265
SMILES:
C[C@@H](C(O)=O)c1ccc2c(c1)n(C(=O)c1ccc(Cl)cc1)c1ccc(Cl)cc21
: