Target
Serine/threonine-protein kinase haspin
Ligand
BDBM50364776
Substrate
Meas. Tech.
ChEMBL_874451 (CHEMBL2184774)
IC50
34±n/a nM
Citation
 Drygin, DHaddach, MPierre, FRyckman, DM Potential use of selective and nonselective Pim kinase inhibitors for cancer therapy. J Med Chem 55:8199-208 (2012)  
Target
Name:
Serine/threonine-protein kinase haspin
Synonyms:
GSG2 H-haspin HASP_HUMAN | Haploid germ cell-specific nuclear protein kinase
Type:
PROTEIN
Mol. Mass.:
88531.28
Organism:
Homo sapiens (Human)
Description:
ChEMBL_1510616
Residue:
798
  
Inhibitor
Name:
BDBM50364776
Synonyms:
CHEMBL1952141 | CHEMBL1952329
Type:
Small organic molecule
Emp. Form.:
C20H22F3N5O
Mol. Mass.:
405.4168
SMILES:
CN1CCC(CNc2ccc3ncc(-c4cccc(OC(F)(F)F)c4)n3n2)CC1
: