Target
Beta-secretase 1
Ligand
BDBM50398262
Substrate
Meas. Tech.
ChEMBL_874893 (CHEMBL2183078)
IC50
2.9±n/a nM
Citation
 Swahn, BMKolmodin, KKarlström, Svon Berg, SSöderman, PHolenz, JBerg, SLindström, JSundström, MTurek, DKihlström, JSlivo, CAndersson, LPyring, DRotticci, DOhberg, LKers, ABogar, Kvon Kieseritzky, FBergh, MOlsson, LLJanson, JEketjäll, SGeorgievska, BJeppsson, FFälting, J Design and synthesis ofß-site amyloid precursor protein cleaving enzyme (BACE1) inhibitors with in vivo brain reduction ofß-amyloid peptides. J Med Chem 55:9346-61 (2012)  
Target
Name:
Beta-secretase 1
Synonyms:
ASP2 Aspartyl protease 2 BACE1 Beta-secretase (BACE) Beta-secretase 1 (BACE 1) Beta-secretase 1 (BACE1) Beta-site amyloid precursor protein cleaving enzyme 1 Memapsin-2 beta-Secretase (BACE-1) | beta-Secretase (BACE1)
Type:
Protein
Mol. Mass.:
55755.10
Organism:
Homo sapiens (Human)
Description:
P56817
Residue:
501
  
Inhibitor
Name:
BDBM50398262
Synonyms:
CHEMBL2177917
Type:
Small organic molecule
Emp. Form.:
C26H22FN5O
Mol. Mass.:
439.4842
SMILES:
COc1c(C)cc(nc1C)C1(N=C(N)c2c1cccc2F)c1cccc(c1)-c1cncnc1
: