Target
Proteasome subunit beta type-5
Ligand
BDBM50398609
Substrate
Meas. Tech.
ChEMBL_874481 (CHEMBL2184804)
IC50
3.4±n/a nM
Citation
 Kale, AJMoore, BS Molecular mechanisms of acquired proteasome inhibitor resistance. J Med Chem 55:10317-27 (2012)  
Target
Name:
Proteasome subunit beta type-5
Synonyms:
20S proteasome chymotrypsin-like LMPX PSB5_HUMAN Proteasome Macropain subunit MB1 X
Type:
Protein
Mol. Mass.:
28480.96
Organism:
Homo sapiens (Human)
Description:
Residue:
263
  
Inhibitor
Name:
BDBM50398609
Synonyms:
CHEMBL2141296 Ixazomib NINLARO
Type:
Small organic molecule
Emp. Form.:
C14H19BCl2N2O4
Mol. Mass.:
361.029
SMILES:
CC(C)C[C@H](NC(=O)CNC(=O)c1cc(Cl)ccc1Cl)B(O)O
: