Target
P2X purinoceptor 4
Ligand
BDBM50118232
Substrate
Meas. Tech.
ChEMBL_876876 (CHEMBL2184470)
EC50
10000±n/a nM
Citation
 Hernandez-Olmos, VAbdelrahman, AEl-Tayeb, AFreudendahl, DWeinhausen, SMüller, CE N-substituted phenoxazine and acridone derivatives: structure-activity relationships of potent P2X4 receptor antagonists. J Med Chem 55:9576-88 (2012)  
Target
Name:
P2X purinoceptor 4
Synonyms:
P2RX4_RAT Purinergic, P2X4
Type:
Enzyme Catalytic Domain
Mol. Mass.:
43504.16
Organism:
RAT
Description:
Purinergic, P2X4 0 RAT::P51577
Residue:
388
  
Inhibitor
Name:
BDBM50118232
Synonyms:
2-MeSATP CHEMBL336208
Type:
Small organic molecule
Emp. Form.:
C11H18N5O13P3S
Mol. Mass.:
553.273
SMILES:
CSc1nc(N)c2ncn([C@@H]3O[C@H](COP(O)(=O)OP(O)(=O)OP(O)(O)=O)[C@@H](O)[C@H]3O)c2n1
: