Target
5-hydroxytryptamine receptor 4
Ligand
BDBM50399630
Substrate
Meas. Tech.
ChEMBL_878536 (CHEMBL2188201)
Ki
115±n/a nM
Citation
 Dubost, EDumas, NFossey, CMagnelli, RButt-Gueulle, SBallandonne, CCaignard, DHDulin, FSopkova de-Oliveira Santos, JMillet, PCharnay, YRault, SCailly, TFabis, F Synthesis and structure-affinity relationships of selective high-affinity 5-HT(4) receptor antagonists: application to the design of new potential single photon emission computed tomography tracers. J Med Chem 55:9693-707 (2012)  
Target
Name:
5-hydroxytryptamine receptor 4
Synonyms:
5-HT4 5HT4R_CAVPO Serotonin 4 (5-HT4) receptor
Type:
Enzyme Catalytic Domain
Mol. Mass.:
43735.29
Organism:
GUINEA PIG
Description:
5-HT4 HTR4 GUINEA PIG::O70528
Residue:
388
  
Inhibitor
Name:
BDBM50399630
Synonyms:
CHEMBL2181167
Type:
Small organic molecule
Emp. Form.:
C28H29IN2O
Mol. Mass.:
536.4471
SMILES:
Ic1ccc(CCCN2CCC(COc3nc4ccccc4c4ccccc34)CC2)cc1
: