Target
Tyrosine-protein kinase SYK
Ligand
BDBM50400034
Substrate
Meas. Tech.
ChEMBL_877991 (CHEMBL2189057)
IC50
17±n/a nM
Citation
 Lucas, MCGoldstein, DMHermann, JCKuglstatter, ALiu, WLuk, KCPadilla, FSlade, MVillaseñor, AGWanner, JXie, WZhang, XLiao, C Rational design of highly selective spleen tyrosine kinase inhibitors. J Med Chem 55:10414-23 (2012)  
Target
Name:
Tyrosine-protein kinase SYK
Synonyms:
KSYK_HUMAN Spleen Tyrosine Kinase Tyrosine-protein kinase SYK (Syk)
Type:
Enzyme
Mol. Mass.:
72079.99
Organism:
Homo sapiens (Human)
Description:
P43405
Residue:
635
  
Inhibitor
Name:
BDBM50400034
Synonyms:
FOSTAMATINIB DISODIUM R935788 SODIUM
Type:
Small organic molecule
Emp. Form.:
C23H24FN6O9P
Mol. Mass.:
578.4447
SMILES:
COc1cc(Nc2ncc(F)c(Nc3ccc4OC(C)(C)C(=O)N(COP([O-])([O-])=O)c4n3)n2)cc(OC)c1OC
: