Target
Induced myeloid leukemia cell differentiation protein Mcl-1
Ligand
BDBM50400179
Substrate
Meas. Tech.
ChEMBL_878601 (CHEMBL2188686)
Ki
53±n/a nM
Citation
 Zhang, ZLi, XSong, TZhao, YFeng, Y An anthraquinone scaffold for putative, two-face Bim BH3a-helix mimic. J Med Chem 55:10735-41 (2012)  
Target
Name:
Induced myeloid leukemia cell differentiation protein Mcl-1
Synonyms:
BCL2L3 Bcl-2-like protein 3 (Mcl-1) Bcl2-L-3 MCL1 Mcl-1 Myeloid cell leukemia sequence 1 (BCL2-related) | mcl1/EAT
Type:
Membrane; Single-pass membrane protein
Mol. Mass.:
37332.87
Organism:
Homo sapiens (Human)
Description:
Q07820
Residue:
350
  
Inhibitor
Name:
BDBM50400179
Synonyms:
2,3‐dihydroxy‐6‐(phenylsulfanyl)anthracene‐9,10‐ dione (Ligand 4) | CHEMBL2180319
Type:
Small organic molecule
Emp. Form.:
C20H12O4S
Mol. Mass.:
348.372
SMILES:
Oc1cc2C(=O)c3ccc(Sc4ccccc4)cc3C(=O)c2cc1O
: