Target
D(3) dopamine receptor
Ligand
BDBM50400512
Substrate
Meas. Tech.
ChEMBL_879545 (CHEMBL2208954)
Ki
0.4±n/a nM
Citation
 Chen, JCollins, GTLevant, BWoods, JDeschamps, JRWang, S CJ-1639: A Potent and Highly Selective Dopamine D3 Receptor Full Agonist. ACS Med Chem Lett 2:620-625 (2011)  
Target
Name:
D(3) dopamine receptor
Synonyms:
DOPAMINE D3 Dopamine D3 receptor | Drd3
Type:
Protein
Mol. Mass.:
49540.58
Organism:
Rattus norvegicus (Rat)
Description:
P19020
Residue:
446
  
Inhibitor
Name:
BDBM50400512
Synonyms:
CHEMBL2203405
Type:
Small organic molecule
Emp. Form.:
C27H34N4O2S
Mol. Mass.:
478.649
SMILES:
CCCN(CC[C@@]1(O)C[C@@H](C1)NC(=O)c1ccc2ccccc2c1)[C@H]1CCc2nc(N)sc2C1
: