Target
Potassium voltage-gated channel subfamily H member 2
Ligand
BDBM50400762
Substrate
Meas. Tech.
ChEMBL_880571 (CHEMBL2211966)
IC50
2000±n/a nM
Citation
 Kuduk, SDChang, RKGreshock, TJRay, WJMa, LWittmann, MSeager, MAKoeplinger, KAThompson, CDHartman, GDBilodeau, MT Identification of amides as carboxylic Acid surrogates for quinolizidinone-based m1 positive allosteric modulators. ACS Med Chem Lett 3:1070-1074 (2012)  
Target
Name:
Potassium voltage-gated channel subfamily H member 2
Synonyms:
1,3-beta-glucan synthase component GLS2 ERG Eag-related protein 1 Ether-a-go-go-related gene (HERG) Ether-a-go-go-related gene potassium channel 1 Ether-a-go-go-related gene potassium channel 1 (hERG1) Ether-a-go-go-related protein 1 H-ERG KCNH2 Potassium voltage-gated channel subfamily H member 2 (hERG) Voltage-gated potassium channel subunit Kv11.1 hERG Potassium Channel 1 | putative potassium channel subunit
Type:
Multi-pass membrane protein
Mol. Mass.:
126672.65
Organism:
Homo sapiens (Human)
Description:
Q12809
Residue:
1159
  
Inhibitor
Name:
BDBM50400762
Synonyms:
CHEMBL2204277
Type:
Small organic molecule
Emp. Form.:
C30H33N5O3
Mol. Mass.:
511.6147
SMILES:
O[C@H]1CCCC[C@@H]1NC(=O)c1cc(CN2CCN(CC2)c2cc3ccccc3cn2)c2ccccn2c1=O
: