Target
C-C chemokine receptor type 5
Ligand
BDBM50400788
Substrate
Meas. Tech.
ChEMBL_879200 (CHEMBL2208513)
IC50
9±n/a nM
Citation
 Armour, DRde Groot, MJPrice, DAStammen, BLWood, APerros, MBurt, C The discovery of tropane-derived CCR5 receptor antagonists. Chem Biol Drug Des 67:305-8 (2006)  
Target
Name:
C-C chemokine receptor type 5
Synonyms:
C-C CKR-5 CC-CKR-5 CCR5 CCR5_HUMAN CHEMR13 HIV-1 fusion coreceptor
Type:
Enzyme
Mol. Mass.:
40540.21
Organism:
Homo sapiens (Human)
Description:
P51681
Residue:
352
  
Inhibitor
Name:
BDBM50400788
Synonyms:
CHEMBL2203612
Type:
Small organic molecule
Emp. Form.:
C29H36N4O2
Mol. Mass.:
472.6217
SMILES:
Cc1nc2ccccc2n1[C@H]1C[C@@H]2COC[C@H](C1)N2CC[C@H](NC(=O)C1CCC1)c1ccccc1
: