Target
C-C chemokine receptor type 5
Ligand
BDBM50400796
Substrate
Meas. Tech.
ChEMBL_879200 (CHEMBL2208513)
IC50
20±n/a nM
Citation
 Armour, DRde Groot, MJPrice, DAStammen, BLWood, APerros, MBurt, C The discovery of tropane-derived CCR5 receptor antagonists. Chem Biol Drug Des 67:305-8 (2006)  
Target
Name:
C-C chemokine receptor type 5
Synonyms:
C-C CKR-5 CC-CKR-5 CCR5 CCR5_HUMAN CHEMR13 HIV-1 fusion coreceptor
Type:
Enzyme
Mol. Mass.:
40540.21
Organism:
Homo sapiens (Human)
Description:
P51681
Residue:
352
  
Inhibitor
Name:
BDBM50400796
Synonyms:
CHEMBL2203614
Type:
Small organic molecule
Emp. Form.:
C27H34N4O
Mol. Mass.:
430.5851
SMILES:
Cc1nc2ccccc2n1C1CCN(CC[C@H](NC(=O)C2CCC2)c2ccccc2)CC1
: