Target
C-X-C chemokine receptor type 3
Ligand
BDBM50400952
Substrate
Meas. Tech.
ChEMBL_880272 (CHEMBL2215850)
Ki
>316.23±n/a nM
Citation
 Wijtmans, MVerzijl, DBergmans, SLai, MBosch, LSmit, MJde Esch, IJLeurs, R CXCR3 antagonists: quaternary ammonium salts equipped with biphenyl- and polycycloaliphatic-anchors. Bioorg Med Chem 19:3384-93 (2011)  
Target
Name:
C-X-C chemokine receptor type 3
Synonyms:
AAO92295.1 C-X-C chemokine receptor type 3 (CXCR3) CXCR3 CXCR3_HUMAN chemokine (C-X-C motif) receptor 3
Type:
Enzyme Catalytic Domain
Mol. Mass.:
40665.65
Organism:
Homo sapiens (Human)
Description:
Residue:
368
  
Inhibitor
Name:
BDBM50400952
Synonyms:
CHEMBL2205698
Type:
Small organic molecule
Emp. Form.:
C24H29N
Mol. Mass.:
331.4938
SMILES:
CN(CC1=CC[C@H]2C[C@@H]1C2(C)C)Cc1cccc(c1)-c1ccccc1
: