Target
C-X-C chemokine receptor type 3
Ligand
BDBM50400971
Substrate
Meas. Tech.
ChEMBL_880272 (CHEMBL2215850)
Ki
1584.89±n/a nM
Citation
 Wijtmans, MVerzijl, DBergmans, SLai, MBosch, LSmit, MJde Esch, IJLeurs, R CXCR3 antagonists: quaternary ammonium salts equipped with biphenyl- and polycycloaliphatic-anchors. Bioorg Med Chem 19:3384-93 (2011)  
Target
Name:
C-X-C chemokine receptor type 3
Synonyms:
AAO92295.1 C-X-C chemokine receptor type 3 (CXCR3) CXCR3 CXCR3_HUMAN chemokine (C-X-C motif) receptor 3
Type:
Enzyme Catalytic Domain
Mol. Mass.:
40665.65
Organism:
Homo sapiens (Human)
Description:
Residue:
368
  
Inhibitor
Name:
BDBM50400971
Synonyms:
CHEMBL2205703
Type:
Small organic molecule
Emp. Form.:
C20H31IN
Mol. Mass.:
412.3708
SMILES:
CC1(C)[C@@H]2CC[C@@]1(C)C(C[N+](C)(C)Cc1ccc(I)cc1)C2
: