Target
Thyroid hormone receptor alpha
Ligand
BDBM50115668
Substrate
Meas. Tech.
ChEMBL_883194 (CHEMBL2212120)
Kd
2.5±n/a nM
Citation
 Joharapurkar, AADhote, VVJain, MR Selective thyromimetics using receptor and tissue selectivity approaches: prospects for dyslipidemia. J Med Chem 55:5649-75 (2012)  
Target
Name:
Thyroid hormone receptor alpha
Synonyms:
C-erbA-alpha EAR7 NR1A1 THA_HUMAN THRA1 Thyroid Hormone Receptor (TR-alpha) Thyroid hormone receptor alpha c-erbA-1
Type:
Receptor
Mol. Mass.:
54818.00
Organism:
Homo sapiens (Human)
Description:
Recombinant hThR was obtained from nuclear extracts from SF9 cells infected with baculovirus vectors encoding for ThRalpha 1.
Residue:
490
  
Inhibitor
Name:
BDBM50115668
Synonyms:
3,5-dimethyl-4-(4'-hydroxy-3'-isopropylbenzyl)phenoxyacetic acid GC-1 US10544075, Compound GC-1 [4-(4-Hydroxy-3-isopropyl-benzyl)-3,5-dimethyl-phenoxy]-acetic acid(GC-1) | {4-[4-hydroxy-3-(1-methylethyl)benzyl]-3,5-dimethylphenoxy}acetic acid
Type:
Small organic molecule
Emp. Form.:
C20H24O4
Mol. Mass.:
328.4022
SMILES:
CC(C)c1cc(Cc2c(C)cc(OCC(O)=O)cc2C)ccc1O
: