Target
Nitric oxide synthase, brain
Ligand
BDBM50401271
Substrate
Meas. Tech.
ChEMBL_882790 (CHEMBL2215017)
IC50
750±n/a nM
Citation
 Annedi, SCMaddaford, SPRamnauth, JRenton, PRybak, TSilverman, SRakhit, SMladenova, GDove, PAndrews, JSZhang, DPorreca, F Discovery of a potent, orally bioavailable and highly selective human neuronal nitric oxide synthase (nNOS) inhibitor, N-(1-(piperidin-4-yl)indolin-5-yl)thiophene-2-carboximidamide as a pre-clinical development candidate for the treatment of migraine. Eur J Med Chem 55:94-107 (2012)  
Target
Name:
Nitric oxide synthase, brain
Synonyms:
Constitutive NOS NC-NOS NOS type I nNOS NOS1_HUMAN Neuronal nitric oxide synthase Nitric oxide synthase, neuronal (nNOS) bNOS | nNOS
Type:
Homodimer
Mol. Mass.:
160985.98
Organism:
Homo sapiens (Human)
Description:
P29475
Residue:
1434
  
Inhibitor
Name:
BDBM50401271
Synonyms:
CHEMBL2203713 | CHEMBL3216328
Type:
Small organic molecule
Emp. Form.:
C18H24Cl2N4S
Mol. Mass.:
399.381
SMILES:
Cl.Cl.N=C(Nc1ccc2N(CCc2c1)C1CCNCC1)c1cccs1
: