Target
C-C chemokine receptor type 5
Ligand
BDBM50401351
Substrate
Meas. Tech.
ChEMBL_884038 (CHEMBL2215087)
EC50
2511.89±n/a nM
Citation
 Thiele, SMalmgaard-Clausen, MEngel-Andreasen, JSteen, ARummel, PCNielsen, MCGloriam, DEFrimurer, TMUlven, TRosenkilde, MM Modulation in selectivity and allosteric properties of small-molecule ligands for CC-chemokine receptors. J Med Chem 55:8164-77 (2012)  
Target
Name:
C-C chemokine receptor type 5
Synonyms:
C-C CKR-5 CC-CKR-5 CCR5 CCR5_HUMAN CHEMR13 HIV-1 fusion coreceptor
Type:
Enzyme
Mol. Mass.:
40540.21
Organism:
Homo sapiens (Human)
Description:
P51681
Residue:
352
  
Inhibitor
Name:
BDBM50401351
Synonyms:
CHEMBL2205807
Type:
Small organic molecule
Emp. Form.:
C12H12N2
Mol. Mass.:
184.2371
SMILES:
Cc1ccc(nc1)-c1ccc(C)cn1
: