Target
C-C chemokine receptor type 5
Ligand
BDBM38924
Substrate
Meas. Tech.
ChEMBL_884030 (CHEMBL2215079)
IC50
25118.86±n/a nM
Citation
 Thiele, SMalmgaard-Clausen, MEngel-Andreasen, JSteen, ARummel, PCNielsen, MCGloriam, DEFrimurer, TMUlven, TRosenkilde, MM Modulation in selectivity and allosteric properties of small-molecule ligands for CC-chemokine receptors. J Med Chem 55:8164-77 (2012)  
Target
Name:
C-C chemokine receptor type 5
Synonyms:
C-C CKR-5 CC-CKR-5 CCR5 CCR5_HUMAN CHEMR13 HIV-1 fusion coreceptor
Type:
Enzyme
Mol. Mass.:
40540.21
Organism:
Homo sapiens (Human)
Description:
P51681
Residue:
352
  
Inhibitor
Name:
BDBM38924
Synonyms:
2,6-bis(2-pyridinyl)pyridine 2,6-dipyridin-2-ylpyridine SMR000060049 | cid_70848
Type:
Small organic molecule
Emp. Form.:
C15H11N3
Mol. Mass.:
233.2679
SMILES:
c1ccc(nc1)-c1cccc(n1)-c1ccccn1
: