Target
Carbonic anhydrase 1
Ligand
BDBM26990
Substrate
Meas. Tech.
ChEMBL_882144 (CHEMBL2214976)
Ki
600±n/a nM
Citation
 Vullo, DDe Luca, VScozzafava, ACarginale, VRossi, MSupuran, CTCapasso, C Anion inhibition studies of the fastest carbonic anhydrase (CA) known, the extremo-CA from the bacterium Sulfurihydrogenibium azorense. Bioorg Med Chem Lett 22:7142-5 (2012)  
Target
Name:
Carbonic anhydrase 1
Synonyms:
CA-I CAB Carbonate dehydratase I Carbonic anhydrase 1 (CA I) Carbonic anhydrase 1 (Recombinant CA I) Carbonic anhydrase B Carbonic anhydrase I (CA I) Carbonic anhydrase I (CAI) Carbonic anhydrase isoenzyme I (hCA I) | hCA
Type:
Enzyme
Mol. Mass.:
28873.37
Organism:
Homo sapiens (Human)
Description:
P00915
Residue:
261
  
Inhibitor
Name:
BDBM26990
Synonyms:
CHEMBL1644699 HS(-1) hydrosulfide | sulfanide
Type:
Ion
Emp. Form.:
HS
Mol. Mass.:
33.073
SMILES:
[SH-]
: