Target
C-C chemokine receptor type 2
Ligand
BDBM50401550
Substrate
Meas. Tech.
ChEMBL_882642 (CHEMBL2213079)
Ki
10±n/a nM
Citation
 Smethurst, CABevan, NBrooks, CEmmons, AGough, PJMookherjee, CMoores, KPeace, SPhilp, JPiercy, VWatson, SPZippoli, M In vivo activity of an azole series of CCR2 antagonists. Bioorg Med Chem Lett 22:7252-5 (2012)  
Target
Name:
C-C chemokine receptor type 2
Synonyms:
C-C chemokine receptor type 2 (CCR2) CCR2_HUMAN Chemoattractant Cytokine Receptor 2 (CCR2) Monocyte chemotactic protein-1 (MCP-1)
Type:
Enzyme
Mol. Mass.:
41932.32
Organism:
Homo sapiens (Human)
Description:
P41597
Residue:
374
  
Inhibitor
Name:
BDBM50401550
Synonyms:
CHEMBL2207084
Type:
Small organic molecule
Emp. Form.:
C15H12Cl3N5O2S
Mol. Mass.:
432.712
SMILES:
Cc1nnnn1Cc1ccc(Cl)cc1NS(=O)(=O)c1ccc(Cl)c(Cl)c1
: