Target
C-C chemokine receptor type 2
Ligand
BDBM50401560
Substrate
Meas. Tech.
ChEMBL_882642 (CHEMBL2213079)
Ki
100±n/a nM
Citation
 Smethurst, CABevan, NBrooks, CEmmons, AGough, PJMookherjee, CMoores, KPeace, SPhilp, JPiercy, VWatson, SPZippoli, M In vivo activity of an azole series of CCR2 antagonists. Bioorg Med Chem Lett 22:7252-5 (2012)  
Target
Name:
C-C chemokine receptor type 2
Synonyms:
C-C chemokine receptor type 2 (CCR2) CCR2_HUMAN Chemoattractant Cytokine Receptor 2 (CCR2) Monocyte chemotactic protein-1 (MCP-1)
Type:
Enzyme
Mol. Mass.:
41932.32
Organism:
Homo sapiens (Human)
Description:
P41597
Residue:
374
  
Inhibitor
Name:
BDBM50401560
Synonyms:
CHEMBL2207087
Type:
Small organic molecule
Emp. Form.:
C15H12Cl2N4O2S
Mol. Mass.:
383.252
SMILES:
Clc1ccc(cc1)S(=O)(=O)Nc1cc(Cl)ccc1Cn1ccnn1
: