Target
Metabotropic glutamate receptor 1
Ligand
BDBM50401704
Substrate
Meas. Tech.
ChEMBL_884986 (CHEMBL2211246)
IC50
154±n/a nM
Citation
 Brumfield, SKorakas, PSilverman, LSTulshian, DMatasi, JJQiang, LBennett, CEBurnett, DAGreenlee, WJKnutson, CEWu, WLSasikumar, TKDomalski, MBertorelli, RGrilli, MLozza, GReggiani, ALi, C Synthesis and SAR development of novel mGluR1 antagonists for the treatment of chronic pain. Bioorg Med Chem Lett 22:7223-6 (2012)  
Target
Name:
Metabotropic glutamate receptor 1
Synonyms:
GPRC1A GRM1_HUMAN Metabotropic Glutamate 1a | metabotropic glutamate 1
Type:
Enzyme
Mol. Mass.:
132358.19
Organism:
Homo sapiens (Human)
Description:
Q13255
Residue:
1194
  
Inhibitor
Name:
BDBM50401704
Synonyms:
CHEMBL2205916
Type:
Small organic molecule
Emp. Form.:
C19H17N5O2S
Mol. Mass.:
379.436
SMILES:
COc1ccc(cc1)-n1cnc2c(sc3ncnc(NCC4CC4)c23)c1=O
: