Target
Sodium-dependent dopamine transporter
Ligand
BDBM50401740
Substrate
Meas. Tech.
ChEMBL_885012 (CHEMBL2211272)
Ki
10.6±n/a nM
Citation
 Pechulis, ADBeck, JPCurry, MAWolf, MAHarms, AEXi, NOpalka, CSweet, MPYang, ZVellekoop, ASKlos, AMCrocker, PJHassler, CLaws, MKitchen, DBSmith, MAOlson, RELiu, SMolino, BF 4-Phenyl tetrahydroisoquinolines as dual norepinephrine and dopamine reuptake inhibitors. Bioorg Med Chem Lett 22:7219-22 (2012)  
Target
Name:
Sodium-dependent dopamine transporter
Synonyms:
DA transporter DAT1 Dopamine transporter protein (DAT) SC6A3_HUMAN Sodium-dependent dopamine transporter Solute carrier family 6 member 3
Type:
Multi-pass membrane protein
Mol. Mass.:
68497.11
Organism:
Homo sapiens (Human)
Description:
Q01959
Residue:
620
  
Inhibitor
Name:
BDBM50401740
Synonyms:
CHEMBL2206529
Type:
Small organic molecule
Emp. Form.:
C18H21N
Mol. Mass.:
251.366
SMILES:
CN1CC(c2ccc(C)cc2)c2cccc(C)c2C1
: