Target
C-C chemokine receptor type 3
Ligand
BDBM50402114
Substrate
Meas. Tech.
ChEMBL_884699 (CHEMBL2215147)
Ki
0.316±n/a nM
Citation
 Furber, MAlcaraz, LLuckhurst, CBahl, ABeaton, HBowers, KCollington, JDenton, RDonald, DKinchin, EMacDonald, CRigby, ARiley, RSoars, MSpringthorpe, BWebborn, P Discovery and evolution of phenoxypiperidine hydroxyamide dual CCR3/H1 antagonists. Part II: optimising in vivo clearance. Bioorg Med Chem Lett 22:7707-10 (2012)  
Target
Name:
C-C chemokine receptor type 3
Synonyms:
C-C CKR-3 CC-CKR-3 CCR3 CD_antigen=CD193 CMKBR3 | Eosinophil eotaxin receptor
Type:
Enzyme
Mol. Mass.:
41053.88
Organism:
Homo sapiens (Human)
Description:
P51677
Residue:
355
  
Inhibitor
Name:
BDBM50402114
Synonyms:
CHEMBL2207654
Type:
Small organic molecule
Emp. Form.:
C27H30Cl2N4O6S
Mol. Mass.:
609.521
SMILES:
O[C@H](CNC(=O)c1c[nH]c(=O)c2cc(ccc12)S(=O)(=O)N1CCC1)CN1CCC(CC1)Oc1ccc(Cl)c(Cl)c1
: