Target
C-C chemokine receptor type 3
Ligand
BDBM50402136
Substrate
Meas. Tech.
ChEMBL_884699 (CHEMBL2215147)
Ki
1.58±n/a nM
Citation
 Furber, MAlcaraz, LLuckhurst, CBahl, ABeaton, HBowers, KCollington, JDenton, RDonald, DKinchin, EMacDonald, CRigby, ARiley, RSoars, MSpringthorpe, BWebborn, P Discovery and evolution of phenoxypiperidine hydroxyamide dual CCR3/H1 antagonists. Part II: optimising in vivo clearance. Bioorg Med Chem Lett 22:7707-10 (2012)  
Target
Name:
C-C chemokine receptor type 3
Synonyms:
C-C CKR-3 CC-CKR-3 CCR3 CD_antigen=CD193 CMKBR3 | Eosinophil eotaxin receptor
Type:
Enzyme
Mol. Mass.:
41053.88
Organism:
Homo sapiens (Human)
Description:
P51677
Residue:
355
  
Inhibitor
Name:
BDBM50402136
Synonyms:
CHEMBL2207666
Type:
Small organic molecule
Emp. Form.:
C24H25Cl2N3O4
Mol. Mass.:
490.379
SMILES:
O[C@H](CNC(=O)c1c[nH]c(=O)c2ccccc12)CN1CCC(CC1)Oc1ccc(Cl)c(Cl)c1
: