Target
Xanthine dehydrogenase/oxidase
Ligand
BDBM50320491
Substrate
Meas. Tech.
ChEMBL_885467 (CHEMBL2209519)
IC50
30±n/a nM
Citation
 Khanna, SBurudkar, SBajaj, KShah, PKeche, AGhosh, UDesai, ASrivastava, AKulkarni-Almeida, ADeshmukh, NJDixit, ABrahma, MKBahirat, UDoshi, LNemmani, KVTannu, PDamre, AB-Rao, CSharma, RSivaramakrishnan, H Isocytosine-based inhibitors of xanthine oxidase: design, synthesis, SAR, PK and in vivo efficacy in rat model of hyperuricemia. Bioorg Med Chem Lett 22:7543-6 (2012)  
Target
Name:
Xanthine dehydrogenase/oxidase
Synonyms:
XD XDHA XO Xanthine dehydrogenase/oxidase | Xanthine oxidase
Type:
Enzyme
Mol. Mass.:
146441.21
Organism:
Homo sapiens (Human)
Description:
P47989
Residue:
1333
  
Inhibitor
Name:
BDBM50320491
Synonyms:
2-(3-CYANO-4-ISOBUTOXY-PHENYL)-4-METHYL-5-THIAZOLE-CARBOXYLIC ACID FEBUXOSTAT | US11744839, Compound of formula 5
Type:
Small organic molecule
Emp. Form.:
C16H16N2O3S
Mol. Mass.:
316.375
SMILES:
CC(C)COc1ccc(cc1C#N)-c1nc(C)c(s1)C(O)=O
: