Target
Glucocorticoid receptor
Ligand
BDBM50402503
Substrate
Meas. Tech.
ChEMBL_886649 (CHEMBL2216234)
Ki
32±n/a nM
Citation
 Hunt, HJRay, NCHynd, GSutton, JSajad, MO'Connor, EAhmed, SLockey, PDaly, SBuckley, GClark, RDRoe, RBlasey, CBelanoff, J Discovery of a novel non-steroidal GR antagonist with in vivo efficacy in the olanzapine-induced weight gain model in the rat. Bioorg Med Chem Lett 22:7376-80 (2012)  
Target
Name:
Glucocorticoid receptor
Synonyms:
GCR_HUMAN GRL Glucocorticoid receptor (GRFP) Nuclear receptor subfamily 3 group C member 1
Type:
Enzyme
Mol. Mass.:
85656.87
Organism:
Homo sapiens (Human)
Description:
P04150
Residue:
777
  
Inhibitor
Name:
BDBM50402503
Synonyms:
CHEMBL2204039
Type:
Small organic molecule
Emp. Form.:
C23H24N2O2
Mol. Mass.:
360.4489
SMILES:
O=c1[nH]c([C@@H]2CC[C@@H](CC2)c2ccccc2)c(Cc2ccccc2)c(=O)[nH]1
: