Target
Cytochrome P450 2D6
Ligand
BDBM50402702
Substrate
Meas. Tech.
ChEMBL_886887 (CHEMBL2211385)
IC50
19500±n/a nM
Citation
 Nirogi, RVBadange, RKambhampati, RChindhe, ADeshpande, ADTiriveedhi, VKandikere, VMuddana, NAbraham, RKhagga, M Design, synthesis and pharmacological evaluation of 4-(piperazin-1-yl methyl)-N1-arylsulfonyl indole derivatives as 5-HT6 receptor ligands. Bioorg Med Chem Lett 22:7431-5 (2012)  
Target
Name:
Cytochrome P450 2D6
Synonyms:
CP2D6_HUMAN CYP2DL1 Cytochrome P450 2D6 (CYP2D6) P450-DB1
Type:
Protein
Mol. Mass.:
55774.82
Organism:
Homo sapiens (Human)
Description:
P10635
Residue:
497
  
Inhibitor
Name:
BDBM50402702
Synonyms:
CHEMBL2207386
Type:
Small organic molecule
Emp. Form.:
C20H22BrN3O2S
Mol. Mass.:
448.377
SMILES:
CN1CCN(Cc2cccc3n(ccc23)S(=O)(=O)c2ccccc2Br)CC1
: