Target
Mu-type opioid receptor
Ligand
BDBM50402777
Substrate
Meas. Tech.
ChEMBL_887196 (CHEMBL2215304)
Ki
0.004900±n/a nM
Citation
 Wentland, MPJo, SGargano, JMVanAlstine, MACohen, DJBidlack, JM Redefining the structure-activity relationships of 2,6-methano-3-benzazocines. Part 8. High affinity ligands for opioid receptors in the picomolar Ki range: oxygenated N-(2-[1,1'-biphenyl]-4-ylethyl) analogues of 8-CAC. Bioorg Med Chem Lett 22:7340-4 (2012)  
Target
Name:
Mu-type opioid receptor
Synonyms:
M-OR-1 MOR-1 MUOR1 Mu opiate receptor OPRM1 hMOP | mu-type opioid receptor isoform MOR-1
Type:
G Protein-Coupled Receptor (GPCR)
Mol. Mass.:
44789.51
Organism:
Homo sapiens (Human)
Description:
P35372
Residue:
400
  
Inhibitor
Name:
BDBM50402777
Synonyms:
CHEMBL2208347
Type:
Small organic molecule
Emp. Form.:
C33H38N2O2
Mol. Mass.:
494.667
SMILES:
C[C@H]1[C@H]2Cc3ccc(cc3[C@]1(C)CCN2CC1CC1)C(=O)NCCc1ccc(cc1)-c1ccc(O)cc1
: