Target
C-C chemokine receptor type 3
Ligand
BDBM50402813
Substrate
Meas. Tech.
ChEMBL_887257 (CHEMBL2215813)
Ki
1.58±n/a nM
Citation
 Furber, MAlcaraz, LLuckhurst, CBahl, ABeaton, HBowers, KCollington, JDenton, RDonald, DKinchin, EMacDonald, CRigby, ARiley, RSoars, MSpringthorpe, BWebborn, P Discovery and evolution of phenoxypiperidine hydroxyamide dual CCR3/H1 antagonists. Part I. Bioorg Med Chem Lett 22:7702-6 (2012)  
Target
Name:
C-C chemokine receptor type 3
Synonyms:
C-C CKR-3 CC-CKR-3 CCR3 CD_antigen=CD193 CMKBR3 | Eosinophil eotaxin receptor
Type:
Enzyme
Mol. Mass.:
41053.88
Organism:
Homo sapiens (Human)
Description:
P51677
Residue:
355
  
Inhibitor
Name:
BDBM50402813
Synonyms:
CHEMBL2208429
Type:
Small organic molecule
Emp. Form.:
C22H24Cl2N4O3
Mol. Mass.:
463.357
SMILES:
O[C@H](CNC(=O)c1n[nH]c2ccccc12)CN1CCC(CC1)Oc1ccc(Cl)c(Cl)c1
: