Target
Carnitine O-palmitoyltransferase 2, mitochondrial
Ligand
BDBM50403031
Substrate
Meas. Tech.
ChEMBL_887417 (CHEMBL2217026)
IC50
4700±n/a nM
Citation
 Ceccarelli, SMChomienne, OGubler, MArduini, A Carnitine palmitoyltransferase (CPT) modulators: a medicinal chemistry perspective on 35 years of research. J Med Chem 54:3109-52 (2011)  
Target
Name:
Carnitine O-palmitoyltransferase 2, mitochondrial
Synonyms:
CPT II CPT2 Carnitine O-palmitoyltransferase 2, mitochondrial Carnitine palmitoyltransferase II
Type:
PROTEIN
Mol. Mass.:
73789.25
Organism:
Homo sapiens (Human)
Description:
ChEMBL_887455
Residue:
658
  
Inhibitor
Name:
BDBM50403031
Synonyms:
CHEMBL2216771
Type:
Small organic molecule
Emp. Form.:
C18H14O5S
Mol. Mass.:
342.366
SMILES:
OC(=O)C(=O)c1ccc(OCCOc2ccc3ccccc3c2)s1
: