Target
Carnitine O-palmitoyltransferase 1, muscle isoform
Ligand
BDBM50403031
Substrate
Meas. Tech.
ChEMBL_887462 (CHEMBL2217071)
IC50
160±n/a nM
Citation
 Ceccarelli, SMChomienne, OGubler, MArduini, A Carnitine palmitoyltransferase (CPT) modulators: a medicinal chemistry perspective on 35 years of research. J Med Chem 54:3109-52 (2011)  
Target
Name:
Carnitine O-palmitoyltransferase 1, muscle isoform
Synonyms:
CPT I CPT1B CPTI-M Carnitine palmitoyltransferase I-like protein | KIAA1670
Type:
PROTEIN
Mol. Mass.:
87823.36
Organism:
Homo sapiens (Human)
Description:
ChEMBL_887440
Residue:
772
  
Inhibitor
Name:
BDBM50403031
Synonyms:
CHEMBL2216771
Type:
Small organic molecule
Emp. Form.:
C18H14O5S
Mol. Mass.:
342.366
SMILES:
OC(=O)C(=O)c1ccc(OCCOc2ccc3ccccc3c2)s1
: