Target
Carnitine O-palmitoyltransferase 2, mitochondrial
Ligand
BDBM50403032
Substrate
Meas. Tech.
ChEMBL_887417 (CHEMBL2217026)
IC50
5400±n/a nM
Citation
 Ceccarelli, SMChomienne, OGubler, MArduini, A Carnitine palmitoyltransferase (CPT) modulators: a medicinal chemistry perspective on 35 years of research. J Med Chem 54:3109-52 (2011)  
Target
Name:
Carnitine O-palmitoyltransferase 2, mitochondrial
Synonyms:
CPT II CPT2 Carnitine O-palmitoyltransferase 2, mitochondrial Carnitine palmitoyltransferase II
Type:
PROTEIN
Mol. Mass.:
73789.25
Organism:
Homo sapiens (Human)
Description:
ChEMBL_887455
Residue:
658
  
Inhibitor
Name:
BDBM50403032
Synonyms:
CHEMBL2216785
Type:
Small organic molecule
Emp. Form.:
C24H41N3O5
Mol. Mass.:
451.5994
SMILES:
CCCCCCOc1cccc(OCCCCNC(=O)N[C@H](CC([O-])=O)C[N+](C)(C)C)c1
: