Target
Carnitine O-palmitoyltransferase 1, liver isoform
Ligand
BDBM50122839
Substrate
Meas. Tech.
ChEMBL_887463 (CHEMBL2217072)
IC50
1050±n/a nM
Citation
 Ceccarelli, SMChomienne, OGubler, MArduini, A Carnitine palmitoyltransferase (CPT) modulators: a medicinal chemistry perspective on 35 years of research. J Med Chem 54:3109-52 (2011)  
Target
Name:
Carnitine O-palmitoyltransferase 1, liver isoform
Synonyms:
CPT I CPT1-L CPT1A_HUMAN Carnitine O-palmitoyltransferase I, liver isoform
Type:
PROTEIN
Mol. Mass.:
88389.31
Organism:
Homo sapiens (Human)
Description:
ChEMBL_887463
Residue:
773
  
Inhibitor
Name:
BDBM50122839
Synonyms:
CHEMBL106227 | [3-Carboxy-2-(3-tetradecyl-ureido)-propyl]-trimethyl-ammonium
Type:
Small organic molecule
Emp. Form.:
C22H45N3O3
Mol. Mass.:
399.611
SMILES:
CCCCCCCCCCCCCCNC(=O)N[C@H](CC([O-])=O)C[N+](C)(C)C
: