Target
Carnitine O-palmitoyltransferase 2, mitochondrial
Ligand
BDBM50403040
Substrate
Meas. Tech.
ChEMBL_887417 (CHEMBL2217026)
IC50
740±n/a nM
Citation
 Ceccarelli, SMChomienne, OGubler, MArduini, A Carnitine palmitoyltransferase (CPT) modulators: a medicinal chemistry perspective on 35 years of research. J Med Chem 54:3109-52 (2011)  
Target
Name:
Carnitine O-palmitoyltransferase 2, mitochondrial
Synonyms:
CPT II CPT2 Carnitine O-palmitoyltransferase 2, mitochondrial Carnitine palmitoyltransferase II
Type:
PROTEIN
Mol. Mass.:
73789.25
Organism:
Homo sapiens (Human)
Description:
ChEMBL_887455
Residue:
658
  
Inhibitor
Name:
BDBM50403040
Synonyms:
CHEMBL2216779
Type:
Small organic molecule
Emp. Form.:
C23H19ClN2O6S
Mol. Mass.:
486.925
SMILES:
COc1ccc(Cl)cc1S(=O)(=O)N1CCc2ccc(cc12)C(=O)Nc1ccc(cc1)C(O)=O
: