Target
Carnitine O-palmitoyltransferase 1, muscle isoform
Ligand
BDBM50403037
Substrate
Meas. Tech.
ChEMBL_887418 (CHEMBL2217027)
IC50
130±n/a nM
Citation
 Ceccarelli, SMChomienne, OGubler, MArduini, A Carnitine palmitoyltransferase (CPT) modulators: a medicinal chemistry perspective on 35 years of research. J Med Chem 54:3109-52 (2011)  
Target
Name:
Carnitine O-palmitoyltransferase 1, muscle isoform
Synonyms:
CPT1B_RAT Cpt1b
Type:
PROTEIN
Mol. Mass.:
88241.28
Organism:
Rattus norvegicus
Description:
ChEMBL_887447
Residue:
772
  
Inhibitor
Name:
BDBM50403037
Synonyms:
CHEMBL2216774
Type:
Small organic molecule
Emp. Form.:
C21H21N3O2S
Mol. Mass.:
379.475
SMILES:
O=C(COc1ccccc1)N1CCCC[C@@H]1c1nc(cs1)-c1ccccn1
: