Target
Carnitine O-palmitoyltransferase 1, liver isoform
Ligand
BDBM50403043
Substrate
Meas. Tech.
ChEMBL_887463 (CHEMBL2217072)
IC50
190±n/a nM
Citation
 Ceccarelli, SMChomienne, OGubler, MArduini, A Carnitine palmitoyltransferase (CPT) modulators: a medicinal chemistry perspective on 35 years of research. J Med Chem 54:3109-52 (2011)  
Target
Name:
Carnitine O-palmitoyltransferase 1, liver isoform
Synonyms:
CPT I CPT1-L CPT1A_HUMAN Carnitine O-palmitoyltransferase I, liver isoform
Type:
PROTEIN
Mol. Mass.:
88389.31
Organism:
Homo sapiens (Human)
Description:
ChEMBL_887463
Residue:
773
  
Inhibitor
Name:
BDBM50403043
Synonyms:
CHEMBL2216780
Type:
Small organic molecule
Emp. Form.:
C20H14Cl2N2O5S
Mol. Mass.:
465.307
SMILES:
OC(=O)c1ccc(NC(=O)c2cccc(NS(=O)(=O)c3ccc(Cl)c(Cl)c3)c2)cc1
: