Target
Thromboxane-A synthase
Ligand
BDBM50391303
Substrate
Meas. Tech.
ChEMBL_212942 (CHEMBL816758)
IC50
100±n/a nM
Citation
 Campbell, ICollington, EFinch, HHayes, RLumley, PMills, KRobertson, GWharton, KWatts, I Synthesis and pharmacological evaluation of combined Thromboxane receptor antagonists/thromboxane synthase inhibitors: Pyridine-containing amino-prostanoids Bioorg Med Chem Lett 1:695-698 (1991)    Article 
Target
Name:
Thromboxane-A synthase
Synonyms:
CYP5 Cytochrome P450 5A1 TBXAS1 TXA synthase TXS Thromboxane A2 Synthase (P450 TxA2) Thromboxane prostanoid Thromboxane-A synthase
Type:
Enzyme
Mol. Mass.:
60524.67
Organism:
Homo sapiens (Human)
Description:
P24557
Residue:
533
  
Inhibitor
Name:
BDBM50391303
Synonyms:
CHEMBL158576
Type:
Small organic molecule
Emp. Form.:
C33H46N2O4
Mol. Mass.:
534.7293
SMILES:
CCCCc1ccncc1-c1ccc(CO[C@@H]2CC[C@@H]([C@H]2OC\C=C/CCC(O)=O)N2CCCCCC2)cc1
: