Target
Histamine H3 receptor
Ligand
BDBM50222968
Substrate
Meas. Tech.
ChEMBL_86932 (CHEMBL697541)
Ki
0.194984±n/a nM
Citation
 Faghih, RDwight, WPan, JBFox, GBKrueger, KMEsbenshade, TAMcVey, JMMarsh, KBennani, YLHancock, AA Synthesis and SAR of aminoalkoxy-biaryl-4-carboxamides: novel and selective histamine H3 receptor antagonists. Bioorg Med Chem Lett 13:1325-8 (2003)  
Target
Name:
Histamine H3 receptor
Synonyms:
HH3R Hrh3
Type:
G Protein-Coupled Receptor (GPCR)
Mol. Mass.:
48607.98
Organism:
Rattus norvegicus (rat)
Description:
Residue:
445
  
Inhibitor
Name:
BDBM50222968
Synonyms:
Cipralisant | GT-2331
Type:
Small organic molecule
Emp. Form.:
C14H20N2
Mol. Mass.:
216.322
SMILES:
CC(C)(C)CCC#C[C@@H]1C[C@H]1c1c[nH]cn1
: