Target
3-oxo-5-alpha-steroid 4-dehydrogenase 1
Ligand
BDBM50407309
Substrate
Meas. Tech.
ChEMBL_204884 (CHEMBL857530)
Ki
>2500±n/a nM
Citation
 Holt, DAYamashita, DSKonialian-Beck, ALLuengo, JIAbell, ADBergsma, DJBrandt, MLevy, MA Benzophenone- and indolecarboxylic acids: potent type-2 specific inhibitors of human steroid 5 alpha-reductase. J Med Chem 38:13-5 (1995)  
Target
Name:
3-oxo-5-alpha-steroid 4-dehydrogenase 1
Synonyms:
3-oxo-5-alpha-steroid 4-dehydrogenase 1 S5A1_HUMAN SR type 1 Steroid 5-alpha-reductase | Steroid 5-alpha-reductase 1
Type:
Enzyme
Mol. Mass.:
29472.80
Organism:
Homo sapiens (Human)
Description:
P18405
Residue:
259
  
Inhibitor
Name:
BDBM50407309
Synonyms:
CHEMBL37725
Type:
Small organic molecule
Emp. Form.:
C17H15NO3
Mol. Mass.:
281.3059
SMILES:
Cn1c(cc2cc(OCc3ccccc3)ccc12)C(O)=O
: