Target
Vasopressin V2 receptor
Ligand
BDBM50407332
Substrate
Meas. Tech.
ChEMBL_215023 (CHEMBL856234)
Kd
26.92±n/a nM
Citation
 Manning, MCheng, LLKlis, WABalaspiri, LOlma, ASawyer, WHWo, NCChan, WY Effects of a D-Cys6/L-Cys6 interchange in nonselective and selective vasopressin and oxytocin antagonists. J Med Chem 38:1762-9 (1995)  
Target
Name:
Vasopressin V2 receptor
Synonyms:
AVPR V2 Avpr2 V2R_RAT Vasopressin receptor
Type:
G-protein coupled receptor
Mol. Mass.:
40761.85
Organism:
Rattus norvegicus (Rat)
Description:
Residue:
371
  
Inhibitor
Name:
BDBM50407332
Synonyms:
CHEMBL405005
Type:
Small organic molecule
Emp. Form.:
C53H77N13O11S2
Mol. Mass.:
1136.389
SMILES:
CCN1[C@@H](Cc2ccc(O)cc2)C(=O)N[C@H](Cc2ccccc2)C(=O)N[C@@H](C(C)C)C(=O)N[C@H](CC(N)=O)C(=O)N[C@@H](CSSC2(CCCCC2)CC1=O)C(=O)N1CCC[C@H]1C(=O)N[C@@H](CCCNC(N)=N)C(=O)NCC(N)=O
: