Target
Vasopressin V2 receptor
Ligand
BDBM50407336
Substrate
Meas. Tech.
ChEMBL_215024 (CHEMBL820875)
Kd
2884.03±n/a nM
Citation
 Manning, MCheng, LLKlis, WABalaspiri, LOlma, ASawyer, WHWo, NCChan, WY Effects of a D-Cys6/L-Cys6 interchange in nonselective and selective vasopressin and oxytocin antagonists. J Med Chem 38:1762-9 (1995)  
Target
Name:
Vasopressin V2 receptor
Synonyms:
AVPR V2 Avpr2 V2R_RAT Vasopressin receptor
Type:
G-protein coupled receptor
Mol. Mass.:
40761.85
Organism:
Rattus norvegicus (Rat)
Description:
Residue:
371
  
Inhibitor
Name:
BDBM50407336
Synonyms:
CHEMBL412616
Type:
Small organic molecule
Emp. Form.:
C52H74N14O12S2
Mol. Mass.:
1151.361
SMILES:
CN1[C@@H](Cc2ccc(O)cc2)C(=O)N[C@H](Cc2ccccc2)C(=O)N[C@@H](CCC(N)=O)C(=O)N[C@H](CC(N)=O)C(=O)N[C@H](CSSC2(CCCCC2)CC1=O)C(=O)N1CCC[C@H]1C(=O)N[C@@H](CCCNC(N)=N)C(=O)NCC(N)=O
: